continuous QA · snosi bootc images

Pipeline status

Data · 2026-10-16 19:30 UTC
selfie cluster · argo workflows

Keep the base still. Prove it every build.

Polling and QA evidence for snosi bootc images. Container suites run on image changes; VM boot and install entries are manual, not automatically continuous. A successful registry poll alone does not prove image QA.

Lanes7tracked workflows and expected products
Image QA passed0fresh verified QA pass
Known QA failure0includes stale failures; not current image status
Unknown / stale evidence3 / 0stale overlaps unknown and failures; older than 6h
Runs21in published snapshot

Image QA badges: passed = fresh Behave evidence; failed = confirmed failure (stale failures stay red but do not establish current image status); unknown = missing, unchanged poll, or legacy evidence; stale = poll older than 6 hours at snapshot generation (old success is not green). Unknown and stale counts overlap for old unverified polls; stale also includes old failures. Workflow phase is separate; other workflow badges describe execution only, not image QA. No retained runs does not establish whether the collector or its credentials are healthy.

01

Installers

1 lane
firn installer matrixunproven

This lane has never passed. Treat its red as a question about the lane, not a finding about the image.

Workflow phase: Failed · not product QA

Reported result: FAILED: boot:rootfs_mismatch (bootc/snow/none/sb=true)

  • bootcbootc_1.16.8
  • bootc_digestsha256:a8b4a633beb1135b6c16c0c071b567076da65fc722cc3a4e2f7953ec0bad9c6f
  • bootc_imageghcr.io/frostyard/snow:latest
  • bootedok
  • loginactive
  • login_unitdisplay-manager.service
  • luksabsent
  • osreleasesnow
  • rootfsoverlay

2026-10-01 16:48:44 UTC · 18m · 2 runs retained

02

Registry polling

3 lanes
snow · Registry digest pollQA not run

Poll execution: Succeeded · Last actual QA in retained runs: passed (historical, not current status)

2026-10-16 18:00:20 UTC · 20s · 4 runs retained

floe · Registry digest pollQA not run

Poll execution: Succeeded · Last actual QA in retained runs: passed (historical, not current status)

2026-10-16 18:20:20 UTC · 20s · 3 runs retained

snowfield · Registry digest pollQA not run

Poll execution: Succeeded · Last actual QA in retained runs: passed (historical, not current status)

2026-10-16 18:40:20 UTC · 20s · 4 runs retained

03

Maintenance

1 lane
Orphan pod GCSucceeded

Workflow phase: Succeeded · not product QA

2026-10-16 18:17:10 UTC · 10s · 3 runs retained

04

Other

2 lanes
publishRunning

Workflow phase: Running · not product QA

2026-10-16 19:30:00 UTC · — · 4 runs retained

run-snow-bootc-lifecycleunproven

This lane has never passed. Treat its red as a question about the lane, not a finding about the image.

Workflow phase: Failed · not product QA

Reported result: FAILED: install_failed:firn_install:unknown:step_failed

  • manifest_sha256bc4128fcd6cbfc0669da668aa0a928401e0fa7b6f266eb0fd91cbb85187c448a
  • tagbefore-install timestamp

2026-09-26 10:52:17 UTC · 3m · 1 run retained

Recent runs

21 of 21 retained
RunProduct / laneWorkflow phaseImage QAStartedDurationResult
publish-results-1792179000publishRunningnot product QA2026-10-16 19:30:00 UTC——
publish-results-1792177200publishSucceedednot product QA2026-10-16 19:00:00 UTC30s—
image-poll-snowfield-latest-1792176000snowfield · Registry digest pollSucceedednot-run2026-10-16 18:40:00 UTC20s—
publish-results-1792175400publishSucceedednot product QA2026-10-16 18:30:00 UTC31s—
image-poll-floe-latest-1792174800floe · Registry digest pollSucceedednot-run2026-10-16 18:20:00 UTC20s—
orphan-pod-gc-1792174620Orphan pod GCSucceedednot product QA2026-10-16 18:17:00 UTC10s—
image-poll-snow-latest-1792173600snow · Registry digest pollSucceedednot-run2026-10-16 18:00:00 UTC20s—
publish-results-1792173600publishSucceedednot product QA2026-10-16 18:00:00 UTC30s—
image-poll-snowfield-latest-1792165200snowfield · Registry digest pollSucceededpassed2026-10-16 15:40:00 UTC1m20 passed
image-poll-floe-latest-1792164000floe · Registry digest pollSucceededpassed2026-10-16 15:20:00 UTC1m14 passed, 6 skipped
image-poll-snow-latest-1792162800snow · Registry digest pollSucceededpassed2026-10-16 15:00:00 UTC1m20 passed
image-poll-snowfield-latest-1792154400snowfield · Registry digest pollSucceedednot-run2026-10-16 12:40:00 UTC20s—
image-poll-floe-latest-1792153200floe · Registry digest pollSucceedednot-run2026-10-16 12:20:00 UTC20s—
orphan-pod-gc-1792153020Orphan pod GCSucceedednot product QA2026-10-16 12:17:00 UTC10s—
image-poll-snow-latest-1792152000snow · Registry digest pollSucceedednot-run2026-10-16 12:00:00 UTC20s—
orphan-pod-gc-1792131420Orphan pod GCSucceedednot product QA2026-10-16 06:17:00 UTC10s—
image-poll-snowfield-latest-1791895200snowfield · Registry digest pollFailedfailed2026-10-13 12:40:00 UTC1m19 passed, 1 failed
image-poll-snow-latest-1791892800snow · Registry digest pollFailedfailed2026-10-13 12:00:00 UTC1m19 passed, 1 failed
bootc-only-iso-install-bnxv8firn installer matrixFailednot product QA2026-10-01 16:30:36 UTC18mFAILED: boot:rootfs_mismatch (bootc/snow/none/sb=true)
bootc-only-iso-install-tx2s4firn installer matrixFailednot product QA2026-10-01 15:25:57 UTC23mFAILED: boot:no_report (bootc/snow/none/sb=true)
run-snow-bootc-lifecycle-6hvn6run-snow-bootc-lifecycleFailednot product QA2026-09-26 10:48:21 UTC3mFAILED: install_failed:firn_install:unknown:step_failed